Target
Amyloid-beta A4 precursor protein-binding family A member 1
Ligand
BDBM54733
Substrate
Meas. Tech.
uHTS Homogeneous Terbium Time-Resolved Fluorescence Resonance Energy Transfer (HTRF) Assay
IC50
2750±n/a nM
Citation
 PubChem, PC uHTS Homogeneous Terbium Time-Resolved Fluorescence Resonance Energy Transfer (HTRF) Assay PubChem Bioassay (2009)[AID] 
Target
Name:
Amyloid-beta A4 precursor protein-binding family A member 1
Synonyms:
APBA1_RAT Mint1 neuronal munc18-1 binding protein
Type:
Enzyme Catalytic Domain
Mol. Mass.:
92603.32
Organism:
Rattus norvegicus
Description:
gi_2625023
Residue:
839
  
Inhibitor
Name:
BDBM54733
Synonyms:
3,3-bis(chloranyl)-1-methyl-quinoline-2,4-dione 3,3-dichloro-1-methyl-quinoline-2,4-quinone MLS000584168 cid_2785054
Type:
Small organic molecule
Emp. Form.:
C10H7Cl2NO2
Mol. Mass.:
244.074
SMILES:
CN1C(=O)C(Cl)(Cl)C(=O)c2ccccc12
: