Target
Amyloid-beta A4 precursor protein-binding family A member 1
Ligand
BDBM34981
Substrate
Meas. Tech.
uHTS Homogeneous Terbium Time-Resolved Fluorescence Resonance Energy Transfer (HTRF) Assay
IC50
2710±n/a nM
Citation
 PubChem, PC uHTS Homogeneous Terbium Time-Resolved Fluorescence Resonance Energy Transfer (HTRF) Assay PubChem Bioassay (2009)[AID] 
Target
Name:
Amyloid-beta A4 precursor protein-binding family A member 1
Synonyms:
APBA1_RAT Mint1 neuronal munc18-1 binding protein
Type:
Enzyme Catalytic Domain
Mol. Mass.:
92603.32
Organism:
Rattus norvegicus
Description:
gi_2625023
Residue:
839
  
Inhibitor
Name:
BDBM34981
Synonyms:
2,3-bis(oxidanyl)-1H-quinolin-4-one 2,3-dihydroxy-4-quinolone SMR000386966 | cid_348135
Type:
Small organic molecule
Emp. Form.:
C9H7NO3
Mol. Mass.:
177.1568
SMILES:
Oc1c(O)c(=O)[nH]c2ccccc12
: