Target
Amyloid-beta A4 precursor protein-binding family A member 1
Ligand
BDBM53124
Substrate
Meas. Tech.
uHTS Homogeneous Terbium Time-Resolved Fluorescence Resonance Energy Transfer (HTRF) Assay
IC50
19800±n/a nM
Citation
 PubChem, PC uHTS Homogeneous Terbium Time-Resolved Fluorescence Resonance Energy Transfer (HTRF) Assay PubChem Bioassay (2009)[AID] 
Target
Name:
Amyloid-beta A4 precursor protein-binding family A member 1
Synonyms:
APBA1_RAT Mint1 neuronal munc18-1 binding protein
Type:
Enzyme Catalytic Domain
Mol. Mass.:
92603.32
Organism:
Rattus norvegicus
Description:
gi_2625023
Residue:
839
  
Inhibitor
Name:
BDBM53124
Synonyms:
4-methoxy-N-[5-[2-oxidanylidene-2-[2-[(E)-(2-oxidanyl-4-oxidanylidene-cyclohexa-2,5-dien-1-ylidene)methyl]hydrazinyl]ethyl]-1,3,4-thiadiazol-2-yl]benzamide N-[5-(2,4-Dihydroxy-benzylidene-hydrazinocarbonylmethyl)-[1,3,4]thiadiazol-2-yl]-4-methoxy-benzamide N-[5-[2-[N'-[(E)-(2-hydroxy-4-keto-cyclohexa-2,5-dien-1-ylidene)methyl]hydrazino]-2-keto-ethyl]-1,3,4-thiadiazol-2-yl]-4-methoxy-benzamide SMR000513871 | cid_24761075
Type:
Small organic molecule
Emp. Form.:
C19H17N5O5S
Mol. Mass.:
427.434
SMILES:
COc1ccc(cc1)C(=O)Nc1nnc(CC(=O)NN=Cc2ccc(O)cc2O)s1
: