Target
Amyloid-beta A4 precursor protein-binding family A member 1
Ligand
BDBM54766
Substrate
Meas. Tech.
uHTS Homogeneous Terbium Time-Resolved Fluorescence Resonance Energy Transfer (HTRF) Assay
IC50
5420±n/a nM
Citation
 PubChem, PC uHTS Homogeneous Terbium Time-Resolved Fluorescence Resonance Energy Transfer (HTRF) Assay PubChem Bioassay (2009)[AID] 
Target
Name:
Amyloid-beta A4 precursor protein-binding family A member 1
Synonyms:
APBA1_RAT Mint1 neuronal munc18-1 binding protein
Type:
Enzyme Catalytic Domain
Mol. Mass.:
92603.32
Organism:
Rattus norvegicus
Description:
gi_2625023
Residue:
839
  
Inhibitor
Name:
BDBM54766
Synonyms:
(3,5-dimethyl-1-piperidinyl)-[2-(5-methyl-2-furanyl)-4-quinolinyl]methanone (3,5-dimethylpiperidino)-[2-(5-methyl-2-furyl)-4-quinolyl]methanone SMR000620346 | cid_3500511
Type:
Small organic molecule
Emp. Form.:
C22H24N2O2
Mol. Mass.:
348.4382
SMILES:
CC1CC(C)CN(C1)C(=O)c1cc(nc2ccccc12)-c1ccc(C)o1
: