Target
Kappa-type opioid receptor
Ligand
BDBM54782
Substrate
Meas. Tech.
HTS Image-Based Screen for Selective Agonists of the KOR Receptor
EC50
12309.49±n/a nM
Citation
 PubChem, PC HTS Image-Based Screen for Selective Agonists of the KOR Receptor PubChem Bioassay (2009)[AID] 
Target
Name:
Kappa-type opioid receptor
Synonyms:
K-OR-1 Kappa-opioid receptor (KOR) Kappa-type opioid receptor (KOR) OPIATE Kappa OPRK1 kappa opioid receptor (KOR)
Type:
G Protein-Coupled Receptor (GPCR)
Mol. Mass.:
42648.76
Organism:
Homo sapiens (Human)
Description:
P41145
Residue:
380
  
Inhibitor
Name:
BDBM54782
Synonyms:
MLS000519747 N-[1-(cyclopentylcarbamoyl)cyclohexyl]-N-(furan-2-ylmethyl)pyridine-2-carboxamide SMR000130165 | cid_3626869
Type:
Small organic molecule
Emp. Form.:
C23H29N3O3
Mol. Mass.:
395.4947
SMILES:
O=C(NC1CCCC1)C1(CCCCC1)N(Cc1ccco1)C(=O)c1ccccn1
: