Target
Streptokinase A
Ligand
BDBM54875
Substrate
Meas. Tech.
Absorbance Microorganism-Based Dose Response Followup to Identify Inhibitors of Streptokinase Expression
EC50
1731±1062 nM
Citation
 PubChem, PC Absorbance Microorganism-Based Dose Response Followup to Identify Inhibitors of Streptokinase Expression PubChem Bioassay (2009)[AID] 
Target
Name:
Streptokinase A
Synonyms:
STRP_STRP1 streptokinase A precursor
Type:
Enzyme Catalytic Domain
Mol. Mass.:
49924.80
Organism:
Streptococcus pyogenes M1 GAS
Description:
gi_15675770
Residue:
440
  
Inhibitor
Name:
BDBM54875
Synonyms:
2-(4-phenyl-1-piperazinyl)-4-(trifluoromethyl)-6,7,8,9-tetrahydro-5H-cyclohepta[d]pyrimidine 2-(4-phenylpiperazino)-4-(trifluoromethyl)-6,7,8,9-tetrahydro-5H-cyclohepta[d]pyrimidine cid_3239703
Type:
Small organic molecule
Emp. Form.:
C20H23F3N4
Mol. Mass.:
376.4186
SMILES:
FC(F)(F)c1nc(nc2CCCCCc12)N1CCN(CC1)c1ccccc1
: