Target
Serine/threonine-protein kinase ATR
Ligand
BDBM268085
Substrate
Meas. Tech.
Time-Resolved Fluorescence Energy Transfer (TR-FRET Tracer A)
pH
7±n/a
IC50
8.16±n/a nM
Comments
extracted
Citation
 Wortmann, LLücking, ULefranc, JBriem, HVon Nussbaum, FBader, BSiemeister, GBone, WLienau, PMoosmayer, DEberspächer, USchick, HEis, KKoppitz, MWengner, AMGrudzinska-Goebel, J 2-(morpholin-4-yl)-1,7-naphthyridines US Patent  US9549932 Publication Date 1/24/2017 
Target
Name:
Serine/threonine-protein kinase ATR
Synonyms:
ATR Ataxia telangiectasia and Rad3-related protein (ATR) FRP1 | Serine-protein kinase ATR
Type:
Protein
Mol. Mass.:
301404.58
Organism:
Homo sapiens (Human)
Description:
Q13535
Residue:
2644
  
Inhibitor
Name:
BDBM268085
Synonyms:
2-[(3R)-3-methylmorpholin-4-yl]-4-(1-propyl-1H-pyrazol-5-yl)-8-(1H-pyrazol-5-yl)-1,7-naphthyridine | US9549932, 117
Type:
Small organic molecule
Emp. Form.:
C27H33N7O2
Mol. Mass.:
487.5966
SMILES:
CCCn1nccc1-c1cc(nc2c(nccc12)-c1ccnn1C1CCCCO1)N1CCOC[C@H]1C
: