Target
Mitogen-activated protein kinase kinase kinase kinase 2
Ligand
BDBM54953
Substrate
Meas. Tech.
Dose Response of SAR compounds via Multiplex HTS Assay for Inhibitors of MEK Kinase PB1 Domains, specifically MEK5 binding to MEK Kinase 2 Wildtype
EC50
30±n/a nM
Citation
 PubChem, PC Dose Response of SAR compounds via Multiplex HTS Assay for Inhibitors of MEK Kinase PB1 Domains, specifically MEK5 binding to MEK Kinase 2 Wildtype PubChem Bioassay (2009)[AID] 
Target
Name:
Mitogen-activated protein kinase kinase kinase kinase 2
Synonyms:
2.7.11.1 GC kinase Germinal center kinase MAP4K2 MEK kinase kinase 2 RAB8IP | Rab8-interacting protein
Type:
Mol. Mass.:
91551.35
Organism:
Homo sapiens (Human)
Description:
Residue:
820
  
Inhibitor
Name:
BDBM54953
Synonyms:
3-(2-furanyl)-6-(2-methoxy-4-nitrophenyl)-[1,2,4]triazolo[3,4-b][1,3,4]thiadiazole 3-(furan-2-yl)-6-(2-methoxy-4-nitro-phenyl)-[1,2,4]triazolo[3,4-b][1,3,4]thiadiazole VU0364703-1 | cid_44236876
Type:
Small organic molecule
Emp. Form.:
C14H9N5O4S
Mol. Mass.:
343.317
SMILES:
COc1cc(ccc1-c1nn2c(nnc2s1)-c1ccco1)[N+]([O-])=O
: