Target
Core protein
Ligand
BDBM35419
Substrate
Meas. Tech.
TR-FRET-based biochemical high-throughput dose response assay to identify inhibitors of Hepatitis C Virus (HCV) core protein dimerization.
IC50
>49751±n/a nM
Citation
 PubChem, PC TR-FRET-based biochemical high-throughput dose response assay to identify inhibitors of Hepatitis C Virus (HCV) core protein dimerization. PubChem Bioassay (2009)[AID] 
Target
Name:
Core protein
Synonyms:
Type:
Enzyme Catalytic Domain
Mol. Mass.:
14237.71
Organism:
Hepatitis C virus
Description:
gi_83779224
Residue:
126
  
Inhibitor
Name:
BDBM35419
Synonyms:
MLS000050867 N-(9-ethyl-9H-carbazol-3-yl)-2-{[4-ethyl-5-(2-furyl)-4H-1,2,4-triazol-3-yl]thio}acetamide N-(9-ethylcarbazol-3-yl)-2-[[4-ethyl-5-(furan-2-yl)-1,2,4-triazol-3-yl]sulfanyl]acetamide SMR000078562 | cid_1890961
Type:
Small organic molecule
Emp. Form.:
C24H23N5O2S
Mol. Mass.:
445.537
SMILES:
CCn1c(SCC(=O)Nc2ccc3n(CC)c4ccccc4c3c2)nnc1-c1ccco1
: