Target
Core protein
Ligand
BDBM40985
Substrate
Meas. Tech.
TR-FRET-based biochemical high-throughput dose response assay to identify inhibitors of Hepatitis C Virus (HCV) core protein dimerization.
IC50
>49751±n/a nM
Citation
 PubChem, PC TR-FRET-based biochemical high-throughput dose response assay to identify inhibitors of Hepatitis C Virus (HCV) core protein dimerization. PubChem Bioassay (2009)[AID] 
Target
Name:
Core protein
Synonyms:
Type:
Enzyme Catalytic Domain
Mol. Mass.:
14237.71
Organism:
Hepatitis C virus
Description:
gi_83779224
Residue:
126
  
Inhibitor
Name:
BDBM40985
Synonyms:
2-(4-chloranyl-3-methyl-phenoxy)-N-[2-methyl-5-(3-methyl-[1,2,4]triazolo[3,4-b][1,3,4]thiadiazol-6-yl)phenyl]ethanamide 2-(4-chloro-3-methylphenoxy)-N-[2-methyl-5-(3-methyl-[1,2,4]triazolo[3,4-b][1,3,4]thiadiazol-6-yl)phenyl]acetamide SMR000092747 | cid_4454678
Type:
Small organic molecule
Emp. Form.:
C20H18ClN5O2S
Mol. Mass.:
427.907
SMILES:
Cc1nnc2sc(nn12)-c1ccc(C)c(NC(=O)COc2ccc(Cl)c(C)c2)c1
: