Target
Core protein
Ligand
BDBM49371
Substrate
Meas. Tech.
TR-FRET-based biochemical high-throughput dose response assay to identify inhibitors of Hepatitis C Virus (HCV) core protein dimerization.
IC50
>49751±n/a nM
Citation
 PubChem, PC TR-FRET-based biochemical high-throughput dose response assay to identify inhibitors of Hepatitis C Virus (HCV) core protein dimerization. PubChem Bioassay (2009)[AID] 
Target
Name:
Core protein
Synonyms:
Type:
Enzyme Catalytic Domain
Mol. Mass.:
14237.71
Organism:
Hepatitis C virus
Description:
gi_83779224
Residue:
126
  
Inhibitor
Name:
BDBM49371
Synonyms:
1,4,5,6-Tetrahydro-cyclopentapyrazole-3-carboxylic acid (2-bromo-3-phenyl-allylidene)-hydrazide N-[(E)-[(E)-2-bromo-3-phenyl-prop-2-enylidene]amino]-1,4,5,6-tetrahydrocyclopenta[c]pyrazole-3-carboxamide N-[[(Z)-2-bromanyl-3-phenyl-prop-2-enylidene]amino]-1,4,5,6-tetrahydrocyclopenta[c]pyrazole-3-carboxamide N-[[(Z)-2-bromo-3-phenylprop-2-enylidene]amino]-1,4,5,6-tetrahydrocyclopenta[c]pyrazole-3-carboxamide cid_1097667
Type:
Small organic molecule
Emp. Form.:
C16H15BrN4O
Mol. Mass.:
359.22
SMILES:
BrC(C=NNC(=O)c1[nH]nc2CCCc12)=Cc1ccccc1
: