Target
Genome polyprotein
Ligand
BDBM55033
Substrate
Meas. Tech.
Fluorescence-based biochemical high throughput dose response assay for inhibitors of the Hepatitis C Virus non-structural protein 3 helicase (NS3).
IC50
4345±n/a nM
Citation
 PubChem, PC Fluorescence-based biochemical high throughput dose response assay for inhibitors of the Hepatitis C Virus non-structural protein 3 helicase (NS3). PubChem Bioassay (2009)[AID] 
Target
Name:
Genome polyprotein
Synonyms:
NS3
Type:
Enzyme Catalytic Domain
Mol. Mass.:
67067.41
Organism:
Hepatitis C virus
Description:
gi_125541954
Residue:
631
  
Inhibitor
Name:
BDBM55033
Synonyms:
5-bromanyl-3-[(E)-3-(4-ethoxyphenyl)prop-2-enoyl]-2-oxidanyl-cyclohepta-2,4,6-trien-1-one 5-bromo-3-[(E)-3-(4-ethoxyphenyl)-1-oxoprop-2-enyl]-2-hydroxy-1-cyclohepta-2,4,6-trienone 5-bromo-3-[3-(4-ethoxyphenyl)acryloyl]-2-hydroxy-2,4,6-cycloheptatrien-1-one SMR000229860 | cid_7314670
Type:
Small organic molecule
Emp. Form.:
C18H15BrO4
Mol. Mass.:
375.213
SMILES:
CCOc1ccc(\C=C\C(=O)c2cc(Br)ccc(=O)c2O)cc1
: