Target
Metabotropic glutamate receptor 4 [Q124R]
Ligand
BDBM55086
Substrate
Meas. Tech.
Modulation of the Metabotropic Glutamate Receptor mGluR4: Rat PAM Potency
EC50
70±n/a nM
Citation
 PubChem, PC Modulation of the Metabotropic Glutamate Receptor mGluR4: Rat PAM Potency PubChem Bioassay (2010)[AID] 
Target
Name:
Metabotropic glutamate receptor 4 [Q124R]
Synonyms:
GRM4_RAT Grm4 glutamate receptor, metabotropic 4 precursor
Type:
Enzyme Catalytic Domain
Mol. Mass.:
101878.86
Organism:
Rattus norvegicus
Description:
gi_12083595
Residue:
912
  
Inhibitor
Name:
BDBM55086
Synonyms:
N-(3-chloro-4-phthalimido-phenyl)picolinamide N-[3-chloro-4-(1,3-dioxoisoindol-2-yl)phenyl]pyridine-2-carboxamide VU0405622-1 | cid_45110131
Type:
Small organic molecule
Emp. Form.:
C20H12ClN3O3
Mol. Mass.:
377.781
SMILES:
Clc1cc(NC(=O)c2ccccn2)ccc1N1C(=O)c2ccccc2C1=O
: