Target
Nuclear receptor ROR-gamma [262-507]
Ligand
BDBM268408
Substrate
Meas. Tech.
Nuclear receptor ROR-gamma
Temperature
298.15±n/a K
EC50
2700±n/a nM
Comments
extracted
Citation
 Fauber, BGobbi, A Keto-imidazopyridine derivatives as RORc modulators US Patent  US9550771 Publication Date 1/24/2017 
Target
Name:
Nuclear receptor ROR-gamma [262-507]
Synonyms:
NR1F3 Nuclear receptor ROR-gamma (aa 262-507) RORC RORG_HUMAN | RZRG
Type:
Enzyme Catalytic Domain
Mol. Mass.:
28605.37
Organism:
Homo sapiens (Human)
Description:
aa 262-507
Residue:
246
  
Inhibitor
Name:
BDBM268408
Synonyms:
1-[3-[2- (trifluoromethyl)benzoyl]imidazo [1,5-a]pyridin-1-yl]piperidine-4- carboxylic acid | US9550771, Example 7
Type:
Small organic molecule
Emp. Form.:
C21H18F3N3O3
Mol. Mass.:
417.3811
SMILES:
OC(=O)C1CCN(CC1)c1nc(C(=O)c2ccccc2C(F)(F)F)n2ccccc12
: