Target
Nuclear receptor ROR-gamma [262-507]
Ligand
BDBM268411
Substrate
Meas. Tech.
Nuclear receptor ROR-gamma
Temperature
298.15±n/a K
EC50
529±n/a nM
Comments
extracted
Citation
 Fauber, BGobbi, A Keto-imidazopyridine derivatives as RORc modulators US Patent  US9550771 Publication Date 1/24/2017 
Target
Name:
Nuclear receptor ROR-gamma [262-507]
Synonyms:
NR1F3 Nuclear receptor ROR-gamma (aa 262-507) RORC RORG_HUMAN | RZRG
Type:
Enzyme Catalytic Domain
Mol. Mass.:
28605.37
Organism:
Homo sapiens (Human)
Description:
aa 262-507
Residue:
246
  
Inhibitor
Name:
BDBM268411
Synonyms:
3-methyl-4-[3-[2- (trifluoromethyl)benzoyl]imidazo [1,5-a]pyridin-1-yl]benzoic acid | US9550771, Example 10
Type:
Small organic molecule
Emp. Form.:
C23H15F3N2O3
Mol. Mass.:
424.372
SMILES:
Cc1cc(ccc1-c1nc(C(=O)c2ccccc2C(F)(F)F)n2ccccc12)C(O)=O
: