Target
Nuclear receptor ROR-gamma [262-507]
Ligand
BDBM268425
Substrate
Meas. Tech.
Nuclear receptor ROR-gamma
Temperature
298.15±n/a K
EC50
3.00±n/a nM
Comments
extracted
Citation
 Fauber, BGobbi, A Keto-imidazopyridine derivatives as RORc modulators US Patent  US9550771 Publication Date 1/24/2017 
Target
Name:
Nuclear receptor ROR-gamma [262-507]
Synonyms:
NR1F3 Nuclear receptor ROR-gamma (aa 262-507) RORC RORG_HUMAN | RZRG
Type:
Enzyme Catalytic Domain
Mol. Mass.:
28605.37
Organism:
Homo sapiens (Human)
Description:
aa 262-507
Residue:
246
  
Inhibitor
Name:
BDBM268425
Synonyms:
4-[3-[2-chloro-6- (trifluoromethyl)benzoyl]-5,6,7,8- tetrahydroimidazo[1,5-a]pyridin- 1-yl]-2-hydroxy-benzoic acid | US9550771, Example 24
Type:
Small organic molecule
Emp. Form.:
C22H16ClF3N2O4
Mol. Mass.:
464.822
SMILES:
OC(=O)c1ccc(cc1O)-c1nc(C(=O)c2c(Cl)cccc2C(F)(F)F)n2CCCCc12
: