Target
Nuclear receptor ROR-gamma [262-507]
Ligand
BDBM268448
Substrate
Meas. Tech.
Nuclear receptor ROR-gamma
Temperature
298.15±n/a K
EC50
50.0±n/a nM
Comments
extracted
Citation
 Fauber, BGobbi, A Keto-imidazopyridine derivatives as RORc modulators US Patent  US9550771 Publication Date 1/24/2017 
Target
Name:
Nuclear receptor ROR-gamma [262-507]
Synonyms:
NR1F3 Nuclear receptor ROR-gamma (aa 262-507) RORC RORG_HUMAN | RZRG
Type:
Enzyme Catalytic Domain
Mol. Mass.:
28605.37
Organism:
Homo sapiens (Human)
Description:
aa 262-507
Residue:
246
  
Inhibitor
Name:
BDBM268448
Synonyms:
2-hydroxy-4-[3-(2- morpholinobenzoyl)imidazo[1,5- a]pyridin-1-yl]benzoic acid | US9550771, Example 47
Type:
Small organic molecule
Emp. Form.:
C25H21N3O5
Mol. Mass.:
443.4513
SMILES:
OC(=O)c1ccc(cc1O)-c1nc(C(=O)c2ccccc2N2CCOCC2)n2ccccc12
: