Target
Nuclear receptor ROR-gamma [262-507]
Ligand
BDBM50106295
Substrate
Meas. Tech.
Nuclear receptor ROR-gamma
Temperature
298.15±n/a K
EC50
191±n/a nM
Comments
extracted
Citation
 Fauber, BGobbi, A Keto-imidazopyridine derivatives as RORc modulators US Patent  US9550771 Publication Date 1/24/2017 
Target
Name:
Nuclear receptor ROR-gamma [262-507]
Synonyms:
NR1F3 Nuclear receptor ROR-gamma (aa 262-507) RORC RORG_HUMAN | RZRG
Type:
Enzyme Catalytic Domain
Mol. Mass.:
28605.37
Organism:
Homo sapiens (Human)
Description:
aa 262-507
Residue:
246
  
Inhibitor
Name:
BDBM50106295
Synonyms:
CHEMBL3596272 | US9550771, Example 64
Type:
Small organic molecule
Emp. Form.:
C21H15ClF2N2O3
Mol. Mass.:
416.805
SMILES:
OC(=O)c1ccc(-c2nc(C(=O)c3c(F)cccc3Cl)n3CCCCc23)c(F)c1
: