Target
Nuclear receptor ROR-gamma [262-507]
Ligand
BDBM268488
Substrate
Meas. Tech.
Nuclear receptor ROR-gamma
Temperature
298.15±n/a K
EC50
691±n/a nM
Comments
extracted
Citation
 Fauber, BGobbi, A Keto-imidazopyridine derivatives as RORc modulators US Patent  US9550771 Publication Date 1/24/2017 
Target
Name:
Nuclear receptor ROR-gamma [262-507]
Synonyms:
NR1F3 Nuclear receptor ROR-gamma (aa 262-507) RORC RORG_HUMAN | RZRG
Type:
Enzyme Catalytic Domain
Mol. Mass.:
28605.37
Organism:
Homo sapiens (Human)
Description:
aa 262-507
Residue:
246
  
Inhibitor
Name:
BDBM268488
Synonyms:
6-[3-[2-chloro-6- (trifluoromethyl)benzoyl]-5,6,7,8- tetrahydroimidazo[1,5-a]pyridin- 1-yl]-1,1-dioxo-1,2-benzothiazol- 3-one | US9550771, Example 87
Type:
Small organic molecule
Emp. Form.:
C22H15ClF3N3O4S
Mol. Mass.:
509.885
SMILES:
FC(F)(F)c1cccc(Cl)c1C(=O)c1nc(c2CCCCn12)-c1ccc2C(=O)NS(=O)(=O)c2c1
: