Target
M18 aspartyl aminopeptidase
Ligand
BDBM55116
Substrate
Meas. Tech.
QFRET-based biochemical high throughput dose response assay for inhibitors of the Plasmodium falciparum M18 Aspartyl Aminopeptidase (PFM18AAP).
IC50
1873±n/a nM
Citation
 PubChem, PC QFRET-based biochemical high throughput dose response assay for inhibitors of the Plasmodium falciparum M18 Aspartyl Aminopeptidase (PFM18AAP). PubChem Bioassay (2009)[AID] 
Target
Name:
M18 aspartyl aminopeptidase
Synonyms:
Type:
Enzyme Catalytic Domain
Mol. Mass.:
65642.43
Organism:
Plasmodium falciparum 3D7
Description:
gi_23505220
Residue:
570
  
Inhibitor
Name:
BDBM55116
Synonyms:
2-(3-methoxyphenyl)-N-(1,2,4-triazol-4-yl)-4-quinolinecarboxamide 2-(3-methoxyphenyl)-N-(1,2,4-triazol-4-yl)quinoline-4-carboxamide SMR000103958 | cid_868804
Type:
Small organic molecule
Emp. Form.:
C19H15N5O2
Mol. Mass.:
345.3547
SMILES:
COc1cccc(c1)-c1cc(C(=O)Nn2cnnc2)c2ccccc2n1
: