Target
M18 aspartyl aminopeptidase
Ligand
BDBM55131
Substrate
Meas. Tech.
QFRET-based biochemical high throughput dose response assay for inhibitors of the Plasmodium falciparum M18 Aspartyl Aminopeptidase (PFM18AAP).
IC50
4613±n/a nM
Citation
 PubChem, PC QFRET-based biochemical high throughput dose response assay for inhibitors of the Plasmodium falciparum M18 Aspartyl Aminopeptidase (PFM18AAP). PubChem Bioassay (2009)[AID] 
Target
Name:
M18 aspartyl aminopeptidase
Synonyms:
Type:
Enzyme Catalytic Domain
Mol. Mass.:
65642.43
Organism:
Plasmodium falciparum 3D7
Description:
gi_23505220
Residue:
570
  
Inhibitor
Name:
BDBM55131
Synonyms:
1-nitro-2-[[(E)-(2-oxidanyl-4-oxidanylidene-cyclohexa-2,5-dien-1-ylidene)methyl]amino]guanidine 2-[[(E)-(2-hydroxy-4-keto-cyclohexa-2,5-dien-1-ylidene)methyl]amino]-1-nitro-guanidine 2-[[(E)-(2-hydroxy-4-oxocyclohexa-2,5-dien-1-ylidene)methyl]amino]-1-nitroguanidine SMR000135281 | cid_9552013
Type:
Small organic molecule
Emp. Form.:
C8H9N5O4
Mol. Mass.:
239.1882
SMILES:
NC(N[N+]([O-])=O)=NN=Cc1ccc(O)cc1O
: