Target
M18 aspartyl aminopeptidase
Ligand
BDBM40728
Substrate
Meas. Tech.
QFRET-based biochemical high throughput dose response assay for inhibitors of the Plasmodium falciparum M18 Aspartyl Aminopeptidase (PFM18AAP).
IC50
1501±n/a nM
Citation
 PubChem, PC QFRET-based biochemical high throughput dose response assay for inhibitors of the Plasmodium falciparum M18 Aspartyl Aminopeptidase (PFM18AAP). PubChem Bioassay (2009)[AID] 
Target
Name:
M18 aspartyl aminopeptidase
Synonyms:
Type:
Enzyme Catalytic Domain
Mol. Mass.:
65642.43
Organism:
Plasmodium falciparum 3D7
Description:
gi_23505220
Residue:
570
  
Inhibitor
Name:
BDBM40728
Synonyms:
2-[2-oxidanylidene-2-[2-[(Z)-(3-oxidanyl-4-oxidanylidene-cyclohexa-2,5-dien-1-ylidene)methyl]hydrazinyl]ethoxy]-N''-[(Z)-(3-oxidanyl-4-oxidanylidene-cyclohexa-2,5-dien-1-ylidene)methyl]benzohydrazide N'-(3,4-dihydroxybenzylidene)-2-{2-[2-(3,4-dihydroxybenzylidene)hydrazino]-2-oxoethoxy}benzohydrazide N''-[(Z)-(3-hydroxy-4-oxo-1-cyclohexa-2,5-dienylidene)methyl]-2-[2-[[(Z)-(3-hydroxy-4-oxo-1-cyclohexa-2,5-dienylidene)methyl]hydrazo]-2-oxoethoxy]benzohydrazide N'-[(Z)-(3-hydroxy-4-keto-cyclohexa-2,5-dien-1-ylidene)methyl]-2-[2-[N'-[(E)-(3-hydroxy-4-keto-cyclohexa-2,5-dien-1-ylidene)methyl]hydrazino]-2-keto-ethoxy]benzohydrazide SMR000161891 | cid_11958779
Type:
Small organic molecule
Emp. Form.:
C23H20N4O7
Mol. Mass.:
464.4275
SMILES:
Oc1ccc(C=NNC(=O)COc2ccccc2C(=O)NN=Cc2ccc(O)c(O)c2)cc1O
: