Target
M18 aspartyl aminopeptidase
Ligand
BDBM55133
Substrate
Meas. Tech.
QFRET-based biochemical high throughput dose response assay for inhibitors of the Plasmodium falciparum M18 Aspartyl Aminopeptidase (PFM18AAP).
IC50
975±n/a nM
Citation
 PubChem, PC QFRET-based biochemical high throughput dose response assay for inhibitors of the Plasmodium falciparum M18 Aspartyl Aminopeptidase (PFM18AAP). PubChem Bioassay (2009)[AID] 
Target
Name:
M18 aspartyl aminopeptidase
Synonyms:
Type:
Enzyme Catalytic Domain
Mol. Mass.:
65642.43
Organism:
Plasmodium falciparum 3D7
Description:
gi_23505220
Residue:
570
  
Inhibitor
Name:
BDBM55133
Synonyms:
MLS000391635 N-(2-bromo-4-nitro-phenyl)-2-(1H-1,2,4-triazol-5-ylthio)acetamide;hydrochloride N-(2-bromo-4-nitrophenyl)-2-(1H-1,2,4-triazol-5-ylthio)acetamide;hydrochloride cid_15945326
Type:
Small organic molecule
Emp. Form.:
C10H8BrN5O3S
Mol. Mass.:
358.171
SMILES:
[O-][N+](=O)c1ccc(NC(=O)CSc2nnc[nH]2)c(Br)c1
: