Target
Procathepsin L
Ligand
BDBM55115
Substrate
Meas. Tech.
QFRET-based counterscreen for inhibitors of PFM18AAP: biochemical high throughput dose response assay for inhibitors of the Cathepsin L proteinase (CTSL1).
IC50
>59642±n/a nM
Citation
 PubChem, PC QFRET-based counterscreen for inhibitors of PFM18AAP: biochemical high throughput dose response assay for inhibitors of the Cathepsin L proteinase (CTSL1). PubChem Bioassay (2009)[AID] 
Target
Name:
Procathepsin L
Synonyms:
CATL1_HUMAN CTSL CTSL1 Cathepsin L Cathepsin L1 heavy chain MEP cathepsin L preproprotein
Type:
Enzyme
Mol. Mass.:
37557.19
Organism:
Homo sapiens (Human)
Description:
Purchased from Calbiochem (San Diego, CA).
Residue:
333
  
Inhibitor
Name:
BDBM55115
Synonyms:
MLS000064663 N-(3-phenyl-1,2,4-thiadiazol-5-yl)-2-(1H-1,2,4-triazol-5-ylsulfanyl)acetamide N-(3-phenyl-1,2,4-thiadiazol-5-yl)-2-(1H-1,2,4-triazol-5-ylthio)acetamide cid_852350
Type:
Small organic molecule
Emp. Form.:
C12H10N6OS2
Mol. Mass.:
318.377
SMILES:
O=C(CSc1nnc[nH]1)Nc1nc(ns1)-c1ccccc1
: