Target
Procathepsin L
Ligand
BDBM55140
Substrate
Meas. Tech.
QFRET-based counterscreen for inhibitors of PFM18AAP: biochemical high throughput dose response assay for inhibitors of the Cathepsin L proteinase (CTSL1).
IC50
>59642±n/a nM
Citation
 PubChem, PC QFRET-based counterscreen for inhibitors of PFM18AAP: biochemical high throughput dose response assay for inhibitors of the Cathepsin L proteinase (CTSL1). PubChem Bioassay (2009)[AID] 
Target
Name:
Procathepsin L
Synonyms:
CATL1_HUMAN CTSL CTSL1 Cathepsin L Cathepsin L1 heavy chain MEP cathepsin L preproprotein
Type:
Enzyme
Mol. Mass.:
37557.19
Organism:
Homo sapiens (Human)
Description:
Purchased from Calbiochem (San Diego, CA).
Residue:
333
  
Inhibitor
Name:
BDBM55140
Synonyms:
(Z)-2-bromanyl-3-phenyl-N-(1,2,4-triazol-4-yl)prop-2-en-1-imine (Z)-2-bromo-3-phenyl-N-(1,2,4-triazol-4-yl)prop-2-en-1-imine SMR000282011 cid_727085
Type:
Small organic molecule
Emp. Form.:
C11H9BrN4
Mol. Mass.:
277.12
SMILES:
Br\C(C=Nn1cnnc1)=C/c1ccccc1
: