Target
Procathepsin L
Ligand
BDBM55173
Substrate
Meas. Tech.
QFRET-based counterscreen for inhibitors of PFM18AAP: biochemical high throughput dose response assay for inhibitors of the Cathepsin L proteinase (CTSL1).
IC50
>59642±n/a nM
Citation
 PubChem, PC QFRET-based counterscreen for inhibitors of PFM18AAP: biochemical high throughput dose response assay for inhibitors of the Cathepsin L proteinase (CTSL1). PubChem Bioassay (2009)[AID] 
Target
Name:
Procathepsin L
Synonyms:
CATL1_HUMAN CTSL CTSL1 Cathepsin L Cathepsin L1 heavy chain MEP cathepsin L preproprotein
Type:
Enzyme
Mol. Mass.:
37557.19
Organism:
Homo sapiens (Human)
Description:
Purchased from Calbiochem (San Diego, CA).
Residue:
333
  
Inhibitor
Name:
BDBM55173
Synonyms:
MLS001146605 N-[(E)-3-(3,4-dihydroxyphenyl)acryloyl]-2-hydroxy-benzamide N-[(E)-3-[3,4-bis(oxidanyl)phenyl]prop-2-enoyl]-2-oxidanyl-benzamide cid_904749
Type:
Small organic molecule
Emp. Form.:
C16H13NO5
Mol. Mass.:
299.2781
SMILES:
Oc1ccc(\C=C\C(=O)NC(=O)c2ccccc2O)cc1O
: