Target
Metabotropic glutamate receptor 4
Ligand
BDBM50293714
Substrate
Meas. Tech.
Modulation of the Metabotropic Glutamate Receptor mGluR4: Potency at human mGluR4
EC50
776±n/a nM
Citation
 PubChem, PC Modulation of the Metabotropic Glutamate Receptor mGluR4: Potency at human mGluR4 PubChem Bioassay (2010)[AID] 
Target
Name:
Metabotropic glutamate receptor 4
Synonyms:
GPRC1D GRM4_HUMAN MGLUR4 Metabotropic glutamate receptor 4 (mGlu4) metabotropic glutamate 4
Type:
Protein
Mol. Mass.:
101899.95
Organism:
Homo sapiens (Human)
Description:
Q14833
Residue:
912
  
Inhibitor
Name:
BDBM50293714
Synonyms:
CHEMBL551635 cid_42644786
Type:
Small organic molecule
Emp. Form.:
C13H11FN2O2
Mol. Mass.:
246.237
SMILES:
COc1cc(NC(=O)c2ccccn2)ccc1F
: