Target
Neutrophil cytosol factor 1 [S99G]
Ligand
BDBM50120
Substrate
Meas. Tech.
Dose Response Confirmation for small molecular inhibitors for p47phox, a regulatory protein of NADPH oxidases (Noxs)
IC50
3130±n/a nM
Citation
 PubChem, PC Dose Response Confirmation for small molecular inhibitors for p47phox, a regulatory protein of NADPH oxidases (Noxs) PubChem Bioassay (2008)[AID] 
Target
Name:
Neutrophil cytosol factor 1 [S99G]
Synonyms:
NCF1 NOXO2 neutrophil cytosolic factor 1
Type:
Enzyme Catalytic Domain
Mol. Mass.:
44664.39
Organism:
Homo sapiens (Human)
Description:
gi_115298672
Residue:
390
  
Inhibitor
Name:
BDBM50120
Synonyms:
2-methyl-1H-perimidine SMR000163078 | cid_750290
Type:
Small organic molecule
Emp. Form.:
C12H10N2
Mol. Mass.:
182.2212
SMILES:
Cc1nc2cccc3cccc([nH]1)c23
: