Target
Neutrophil cytosol factor 1 [S99G]
Ligand
BDBM48732
Substrate
Meas. Tech.
Dose Response Confirmation for small molecular inhibitors for p47phox, a regulatory protein of NADPH oxidases (Noxs)
IC50
3460±n/a nM
Citation
 PubChem, PC Dose Response Confirmation for small molecular inhibitors for p47phox, a regulatory protein of NADPH oxidases (Noxs) PubChem Bioassay (2008)[AID] 
Target
Name:
Neutrophil cytosol factor 1 [S99G]
Synonyms:
NCF1 NOXO2 neutrophil cytosolic factor 1
Type:
Enzyme Catalytic Domain
Mol. Mass.:
44664.39
Organism:
Homo sapiens (Human)
Description:
gi_115298672
Residue:
390
  
Inhibitor
Name:
BDBM48732
Synonyms:
(1-cetyl-4-pyridylidene)methyl-keto-ammonium;bromide (1-hexadecylpyridin-4-ylidene)methyl-oxidanylidene-azanium;bromide 1-Hexadecyl-4-(hydroxyimino-methyl)-pyridinium SMR000212939 | cid_11293258
Type:
Small organic molecule
Emp. Form.:
C22H39N2O
Mol. Mass.:
347.5573
SMILES:
[#6]-[#6]-[#6]-[#6]-[#6]-[#6]-[#6]-[#6]-[#6]-[#6]-[#6]-[#6]-[#6]-[#6]-[#6]-[#6]-[#7]-1-[#6]=[#6]\[#6](=[#6]\[#7+]=O)-[#6]=[#6]-1
: