Target
Neutrophil cytosol factor 1 [S99G]
Ligand
BDBM55645
Substrate
Meas. Tech.
Dose Response Confirmation for small molecular inhibitors for p47phox, a regulatory protein of NADPH oxidases (Noxs)
IC50
3250±n/a nM
Citation
 PubChem, PC Dose Response Confirmation for small molecular inhibitors for p47phox, a regulatory protein of NADPH oxidases (Noxs) PubChem Bioassay (2008)[AID] 
Target
Name:
Neutrophil cytosol factor 1 [S99G]
Synonyms:
NCF1 NOXO2 neutrophil cytosolic factor 1
Type:
Enzyme Catalytic Domain
Mol. Mass.:
44664.39
Organism:
Homo sapiens (Human)
Description:
gi_115298672
Residue:
390
  
Inhibitor
Name:
BDBM55645
Synonyms:
MLS000389507 cid_3336580
Type:
Small organic molecule
Emp. Form.:
C33H34FN5O5
Mol. Mass.:
599.652
SMILES:
CCOc1ccc(NC(=O)c2ccc(NC(=O)c3cn4C(C)COc5c(N6CCN(C)CC6)c(F)cc(c45)c3=O)cc2)cc1
: