Target
Neutrophil cytosol factor 1 [S99G]
Ligand
BDBM55695
Substrate
Meas. Tech.
Dose Response Confirmation for small molecular inhibitors for p47phox, a regulatory protein of NADPH oxidases (Noxs)
IC50
4580±n/a nM
Citation
 PubChem, PC Dose Response Confirmation for small molecular inhibitors for p47phox, a regulatory protein of NADPH oxidases (Noxs) PubChem Bioassay (2008)[AID] 
Target
Name:
Neutrophil cytosol factor 1 [S99G]
Synonyms:
NCF1 NOXO2 neutrophil cytosolic factor 1
Type:
Enzyme Catalytic Domain
Mol. Mass.:
44664.39
Organism:
Homo sapiens (Human)
Description:
gi_115298672
Residue:
390
  
Inhibitor
Name:
BDBM55695
Synonyms:
(1Z)-1-[(4-nitroanilino)methylene]naphthalen-2-one (1Z)-1-[(4-nitroanilino)methylidene]naphthalen-2-one 1-{[(E)-4-Nitro-phenylimino]-methyl}-naphthalen-2-ol SMR000217280 | cid_5378393
Type:
Small organic molecule
Emp. Form.:
C17H12N2O3
Mol. Mass.:
292.2888
SMILES:
[O-][N+](=O)c1ccc(cc1)\[NH+]=C\[c-]1c2ccccc2ccc1=O
: