Target
Neutrophil cytosol factor 1 [S99G]
Ligand
BDBM48866
Substrate
Meas. Tech.
Dose Response Confirmation for small molecular inhibitors for p47phox, a regulatory protein of NADPH oxidases (Noxs)
IC50
50000±n/a nM
Citation
 PubChem, PC Dose Response Confirmation for small molecular inhibitors for p47phox, a regulatory protein of NADPH oxidases (Noxs) PubChem Bioassay (2008)[AID] 
Target
Name:
Neutrophil cytosol factor 1 [S99G]
Synonyms:
NCF1 NOXO2 neutrophil cytosolic factor 1
Type:
Enzyme Catalytic Domain
Mol. Mass.:
44664.39
Organism:
Homo sapiens (Human)
Description:
gi_115298672
Residue:
390
  
Inhibitor
Name:
BDBM48866
Synonyms:
2,5-bis(azanyl)benzoic acid;hydrochloride MLS000716510 cid_16195270
Type:
Small organic molecule
Emp. Form.:
C7H8N2O2
Mol. Mass.:
152.1506
SMILES:
Nc1ccc(N)c(c1)C(O)=O
: