Target
Neutrophil cytosol factor 1 [S99G]
Ligand
BDBM55864
Substrate
Meas. Tech.
Dose Response Confirmation for small molecular inhibitors for p47phox, a regulatory protein of NADPH oxidases (Noxs)
IC50
50000±n/a nM
Citation
 PubChem, PC Dose Response Confirmation for small molecular inhibitors for p47phox, a regulatory protein of NADPH oxidases (Noxs) PubChem Bioassay (2008)[AID] 
Target
Name:
Neutrophil cytosol factor 1 [S99G]
Synonyms:
NCF1 NOXO2 neutrophil cytosolic factor 1
Type:
Enzyme Catalytic Domain
Mol. Mass.:
44664.39
Organism:
Homo sapiens (Human)
Description:
gi_115298672
Residue:
390
  
Inhibitor
Name:
BDBM55864
Synonyms:
(4-Oxo-3,5,6,7-tetrahydro-4H-cyclopenta[4,5]thieno[2,3-d]pyrimidin-2-ylsulfanyl)-acetic acid methyl ester 2-[(1-oxo-2,6,7,8-tetrahydrocyclopenta[2,3]thieno[2,4-b]pyrimidin-3-yl)thio]acetic acid methyl ester SMR000413212 methyl 2-[(1-oxidanylidene-2,6,7,8-tetrahydrocyclopenta[2,3]thieno[2,4-b]pyrimidin-3-yl)sulfanyl]ethanoate | methyl 2-[(1-oxo-2,6,7,8-tetrahydrocyclopenta[2,3]thieno[2,4-b]pyrimidin-3-yl)sulfanyl]acetate
Type:
Small organic molecule
Emp. Form.:
C12H12N2O3S2
Mol. Mass.:
296.365
SMILES:
COC(=O)CSc1nc2sc3CCCc3c2c(=O)[nH]1
: