Target
Kallikrein-5
Ligand
BDBM32805
Substrate
Meas. Tech.
Kallikrein 5 1536 HTS Dose Response Confirmation
IC50
2441.4±n/a nM
Citation
 PubChem, PC Kallikrein 5 1536 HTS Dose Response Confirmation PubChem Bioassay (2008)[AID] 
Target
Name:
Kallikrein-5
Synonyms:
KLK5 Kallikrein 5 kallikrein-related peptidase 5 preproprotein
Type:
PROTEIN
Mol. Mass.:
32031.72
Organism:
Homo sapiens (Human)
Description:
EBI_12584
Residue:
293
  
Inhibitor
Name:
BDBM32805
Synonyms:
(5-chloranylpyridin-3-yl) furan-2-carboxylate 2-furancarboxylic acid (5-chloro-3-pyridinyl) ester CHEMBL222840 SMR000114552 cid_7230550 med.21724, Compound 93
Type:
Small organic molecule
Emp. Form.:
C10H6ClNO3
Mol. Mass.:
223.613
SMILES:
Clc1cncc(OC(=O)c2ccco2)c1
: