Target
Kallikrein-5
Ligand
BDBM56591
Substrate
Meas. Tech.
Kallikrein 5 1536 HTS Dose Response Confirmation
IC50
50000±n/a nM
Citation
 PubChem, PC Kallikrein 5 1536 HTS Dose Response Confirmation PubChem Bioassay (2008)[AID] 
Target
Name:
Kallikrein-5
Synonyms:
KLK5 Kallikrein 5 kallikrein-related peptidase 5 preproprotein
Type:
PROTEIN
Mol. Mass.:
32031.72
Organism:
Homo sapiens (Human)
Description:
EBI_12584
Residue:
293
  
Inhibitor
Name:
BDBM56591
Synonyms:
(6-fluoranyl-1,3-benzothiazol-2-yl)diazane MLS000724920 cid_2049844
Type:
Small organic molecule
Emp. Form.:
C7H6FN3S
Mol. Mass.:
183.206
SMILES:
NNc1nc2ccc(F)cc2s1
: