Target
DNA repair protein RAD51 homolog 1
Ligand
BDBM56851
Substrate
Meas. Tech.
Homologous Recombination - Rad 51_Dose response
IC50
42500±n/a nM
Citation
 PubChem, PC Homologous Recombination - Rad 51_Dose response PubChem Bioassay (2008)[AID] 
Target
Name:
DNA repair protein RAD51 homolog 1
Synonyms:
RAD51 RAD51_HUMAN | RECA
Type:
Enzyme Catalytic Domain
Mol. Mass.:
36960.74
Organism:
Homo sapiens (Human)
Description:
gi_49168602
Residue:
339
  
Inhibitor
Name:
BDBM56851
Synonyms:
2-(1,1-dioxido-3-oxo-1,2-benzisothiazol-2(3H)-yl)-N-[4-(1-piperidinylsulfonyl)phenyl]acetamide N-(4-piperidin-1-ylsulfonylphenyl)-2-(1,1,3-trioxo-1,2-benzothiazol-2-yl)acetamide N-(4-piperidinosulfonylphenyl)-2-(1,1,3-triketo-1,2-benzothiazol-2-yl)acetamide SMR000074755 | cid_1305851
Type:
Small organic molecule
Emp. Form.:
C20H21N3O6S2
Mol. Mass.:
463.527
SMILES:
O=C(CN1C(=O)c2ccccc2S1(=O)=O)Nc1ccc(cc1)S(=O)(=O)N1CCCCC1
: