Target
Streptokinase A
Ligand
BDBM58165
Substrate
Meas. Tech.
Absorbance Microorganism-Based Dose Response HTS to Identify Inhibitors of Streptokinase Expression
EC50
150000±n/a nM
Citation
 PubChem, PC Absorbance Microorganism-Based Dose Response HTS to Identify Inhibitors of Streptokinase Expression PubChem Bioassay (2009)[AID] 
Target
Name:
Streptokinase A
Synonyms:
STRP_STRP1 streptokinase A precursor
Type:
Enzyme Catalytic Domain
Mol. Mass.:
49924.80
Organism:
Streptococcus pyogenes M1 GAS
Description:
gi_15675770
Residue:
440
  
Inhibitor
Name:
BDBM58165
Synonyms:
1-(4-methoxyphenyl)-3-[(2-oxidanylideneindol-3-yl)amino]thiourea 1-(4-methoxyphenyl)-3-[(2-oxoindol-3-yl)amino]thiourea MLS000777367 cid_5357223
Type:
Small organic molecule
Emp. Form.:
C16H14N4O2S
Mol. Mass.:
326.373
SMILES:
COc1ccc(NC(=S)NNC2=c3ccccc3=NC2=O)cc1
: