Target
Streptokinase A
Ligand
BDBM58219
Substrate
Meas. Tech.
Absorbance Microorganism-Based Dose Response HTS to Identify Inhibitors of Streptokinase Expression
EC50
2852±n/a nM
Citation
 PubChem, PC Absorbance Microorganism-Based Dose Response HTS to Identify Inhibitors of Streptokinase Expression PubChem Bioassay (2009)[AID] 
Target
Name:
Streptokinase A
Synonyms:
STRP_STRP1 streptokinase A precursor
Type:
Enzyme Catalytic Domain
Mol. Mass.:
49924.80
Organism:
Streptococcus pyogenes M1 GAS
Description:
gi_15675770
Residue:
440
  
Inhibitor
Name:
BDBM58219
Synonyms:
3-(tert-butyl)-1-(4-fluorobenzyl)-N-(4-fluorophenyl)-1H-pyrazole-5-carboxamide 5-tert-butyl-N-(4-fluorophenyl)-2-[(4-fluorophenyl)methyl]-3-pyrazolecarboxamide MLS000830152 cid_2809849
Type:
Small organic molecule
Emp. Form.:
C21H21F2N3O
Mol. Mass.:
369.4077
SMILES:
CC(C)(C)c1cc(C(=O)Nc2ccc(F)cc2)n(Cc2ccc(F)cc2)n1
: