Target
Streptokinase A
Ligand
BDBM50054245
Substrate
Meas. Tech.
Absorbance Microorganism-Based Dose Response HTS to Identify Inhibitors of Streptokinase Expression
EC50
1307±n/a nM
Citation
 PubChem, PC Absorbance Microorganism-Based Dose Response HTS to Identify Inhibitors of Streptokinase Expression PubChem Bioassay (2009)[AID] 
Target
Name:
Streptokinase A
Synonyms:
STRP_STRP1 streptokinase A precursor
Type:
Enzyme Catalytic Domain
Mol. Mass.:
49924.80
Organism:
Streptococcus pyogenes M1 GAS
Description:
gi_15675770
Residue:
440
  
Inhibitor
Name:
BDBM50054245
Synonyms:
5-Chloro-N-cyclopropylmethyl-2-methyl-N-propyl-N''-(2,4,6-trichloro-phenyl)-pyrimidine-4,6-diamine CHEMBL45281 | cid_176157
Type:
Small organic molecule
Emp. Form.:
C18H20Cl4N4
Mol. Mass.:
434.19
SMILES:
CCCN(CC1CC1)c1nc(C)nc(Nc2c(Cl)cc(Cl)cc2Cl)c1Cl
: