Target
Streptokinase A
Ligand
BDBM58646
Substrate
Meas. Tech.
Absorbance Microorganism-Based Dose Response HTS to Identify Inhibitors of Streptokinase Expression
EC50
150000±n/a nM
Citation
 PubChem, PC Absorbance Microorganism-Based Dose Response HTS to Identify Inhibitors of Streptokinase Expression PubChem Bioassay (2009)[AID] 
Target
Name:
Streptokinase A
Synonyms:
STRP_STRP1 streptokinase A precursor
Type:
Enzyme Catalytic Domain
Mol. Mass.:
49924.80
Organism:
Streptococcus pyogenes M1 GAS
Description:
gi_15675770
Residue:
440
  
Inhibitor
Name:
BDBM58646
Synonyms:
MLS001072370 [4-(7-chloro-3,5-dimethyl-1-benzofuran-2-carbonyl)piperazin-1-yl]-(furan-2-yl)methanone [4-[(7-chloranyl-3,5-dimethyl-1-benzofuran-2-yl)carbonyl]piperazin-1-yl]-(furan-2-yl)methanone cid_24816679
Type:
Small organic molecule
Emp. Form.:
C20H19ClN2O4
Mol. Mass.:
386.829
SMILES:
Cc1c(oc2c(Cl)cc(C)cc12)C(=O)N1CCN(CC1)C(=O)c1ccco1
: