Target
Streptokinase A
Ligand
BDBM58771
Substrate
Meas. Tech.
Absorbance Microorganism-Based Dose Response HTS to Identify Inhibitors of Streptokinase Expression
EC50
150000±n/a nM
Citation
 PubChem, PC Absorbance Microorganism-Based Dose Response HTS to Identify Inhibitors of Streptokinase Expression PubChem Bioassay (2009)[AID] 
Target
Name:
Streptokinase A
Synonyms:
STRP_STRP1 streptokinase A precursor
Type:
Enzyme Catalytic Domain
Mol. Mass.:
49924.80
Organism:
Streptococcus pyogenes M1 GAS
Description:
gi_15675770
Residue:
440
  
Inhibitor
Name:
BDBM58771
Synonyms:
7-[4-[(3,5-dimethoxybenzoyl)carbamothioyl]piperazin-1-yl]-1-ethyl-6-fluoro-4-oxoquinoline-3-carboxylic acid 7-[4-[(3,5-dimethoxyphenyl)carbonylcarbamothioyl]piperazin-1-yl]-1-ethyl-6-fluoranyl-4-oxidanylidene-quinoline-3-carboxylic acid MLS001075342 cid_4640068
Type:
Small organic molecule
Emp. Form.:
C26H27FN4O6S
Mol. Mass.:
542.579
SMILES:
CCn1cc(C(O)=O)c(=O)c2cc(F)c(cc12)N1CCN(CC1)C(=S)NC(=O)c1cc(OC)cc(OC)c1
: