Target
Large T antigen
Ligand
BDBM32012
Substrate
Meas. Tech.
Identification of SV40 T antigen inhibitors: Cytotoxicity screen of selected hits
EC50
>50000±n/a nM
Citation
 PubChem, PC Identification of SV40 T antigen inhibitors: Cytotoxicity screen of selected hits PubChem Bioassay (2009)[AID] 
Target
Name:
Large T antigen
Synonyms:
LT LT_SV40
Type:
Enzyme Catalytic Domain
Mol. Mass.:
81575.54
Organism:
Simian virus 40
Description:
P03070
Residue:
708
  
Inhibitor
Name:
BDBM32012
Synonyms:
1-(3,4-Dihydroxy-phenyl)-2-(5-phenyl-4H-[1,2,4]triazol-3-ylsulfanyl)-ethanone 1-(3,4-dihydroxyphenyl)-2-[(5-phenyl-1H-1,2,4-triazol-3-yl)thio]ethanone CHEMBL358546 SMR000011758 | cid_654283
Type:
Small organic molecule
Emp. Form.:
C16H13N3O3S
Mol. Mass.:
327.358
SMILES:
Oc1ccc(cc1O)C(=O)CSc1nnc([nH]1)-c1ccccc1
: