Target
Large T antigen
Ligand
BDBM59009
Substrate
Meas. Tech.
Identification of SV40 T antigen inhibitors: Cytotoxicity screen of selected hits
EC50
15030±n/a nM
Citation
 PubChem, PC Identification of SV40 T antigen inhibitors: Cytotoxicity screen of selected hits PubChem Bioassay (2009)[AID] 
Target
Name:
Large T antigen
Synonyms:
LT LT_SV40
Type:
Enzyme Catalytic Domain
Mol. Mass.:
81575.54
Organism:
Simian virus 40
Description:
P03070
Residue:
708
  
Inhibitor
Name:
BDBM59009
Synonyms:
1-(2,4-dimethylphenyl)-3-[[1-(4-methoxyphenyl)-3-pyrrolidinyl]methyl]thiourea MLS000683541 SMR000311698 | cid_3493148
Type:
Small organic molecule
Emp. Form.:
C21H27N3OS
Mol. Mass.:
369.524
SMILES:
COc1ccc(cc1)N1CCC(CNC(=S)Nc2ccc(C)cc2C)C1
: