Target
Large T antigen
Ligand
BDBM50208827
Substrate
Meas. Tech.
Identification of SV40 T antigen inhibitors: Cytotoxicity screen of selected hits
EC50
28240±n/a nM
Citation
 PubChem, PC Identification of SV40 T antigen inhibitors: Cytotoxicity screen of selected hits PubChem Bioassay (2009)[AID] 
Target
Name:
Large T antigen
Synonyms:
LT LT_SV40
Type:
Enzyme Catalytic Domain
Mol. Mass.:
81575.54
Organism:
Simian virus 40
Description:
P03070
Residue:
708
  
Inhibitor
Name:
BDBM50208827
Synonyms:
2,3-bis(2-hydroxyethylthio)naphthalene-1,4-dione N1786 (NSC95397) NSC 95397 cid_262093
Type:
Small organic molecule
Emp. Form.:
C14H14O4S2
Mol. Mass.:
310.389
SMILES:
OCCSC1=C(SCCO)C(=O)c2ccccc2C1=O
: