Target
Sodium channel protein type 9 subunit alpha
Ligand
BDBM268480
Substrate
Meas. Tech.
Electrophysiological Assay (EP) (In Vitro Assay)
pH
7.2±n/a
IC50
138±n/a nM
Comments
extracted
Citation
 Bichler, PRChowdhury, SDecker, SMDehnhardt, CMFocken, TGrimwood, MEHemeon, IWSafina, BSheng, TSun, SWilson, MSZenova, AY Substituted triazolopyridines and methods of use thereof US Patent  US9550775 Publication Date 1/24/2017 
Target
Name:
Sodium channel protein type 9 subunit alpha
Synonyms:
NENA Peripheral sodium channel 1 SCN9A_HUMAN Voltage-gated sodium channel subunit Nav1.7 hNE-Na
Type:
Protein
Mol. Mass.:
226375.97
Organism:
Homo sapiens (Human)
Description:
Q15858
Residue:
1988
  
Inhibitor
Name:
BDBM268480
Synonyms:
N-(7-((3r,5r,7r)-adamantan-1-ylmethoxy)-6-ethyl-[1,2,4]triazolo[4,3-a]pyridin-3-yl)-3-fluoroazetidine-1-sulfonamide | US9550775, 15
Type:
Small organic molecule
Emp. Form.:
C22H30FN5O3S
Mol. Mass.:
463.569
SMILES:
CCc1cn2c(NS(=O)(=O)N3CC(F)C3)nnc2cc1OCC12CC3CC(CC(C3)C1)C2
: