Target
Sodium channel protein type 9 subunit alpha
Ligand
BDBM268509
Substrate
Meas. Tech.
Electrophysiological Assay (EP) (In Vitro Assay)
pH
7.2±n/a
IC50
133±n/a nM
Comments
extracted
Citation
 Bichler, PRChowdhury, SDecker, SMDehnhardt, CMFocken, TGrimwood, MEHemeon, IWSafina, BSheng, TSun, SWilson, MSZenova, AY Substituted triazolopyridines and methods of use thereof US Patent  US9550775 Publication Date 1/24/2017 
Target
Name:
Sodium channel protein type 9 subunit alpha
Synonyms:
NENA Peripheral sodium channel 1 SCN9A_HUMAN Voltage-gated sodium channel subunit Nav1.7 hNE-Na
Type:
Protein
Mol. Mass.:
226375.97
Organism:
Homo sapiens (Human)
Description:
Q15858
Residue:
1988
  
Inhibitor
Name:
BDBM268509
Synonyms:
N-(6-(2-methoxypyridin-3-yl)-7-(trans-4-methylcyclohexyl)methoxy)-[1,2,4]triazolo[4,3-a]pyridin-3-yl)methanesulfonamide) | US9550775, 34
Type:
Small organic molecule
Emp. Form.:
C21H27N5O4S
Mol. Mass.:
445.535
SMILES:
COc1ncccc1-c1cn2c(NS(C)(=O)=O)nnc2cc1OC[C@H]1CC[C@H](C)CC1
: