Target
Sodium channel protein type 9 subunit alpha
Ligand
BDBM268523
Substrate
Meas. Tech.
Electrophysiological Assay (EP) (In Vitro Assay)
pH
7.2±n/a
IC50
7.00±n/a nM
Comments
extracted
Citation
 Bichler, PRChowdhury, SDecker, SMDehnhardt, CMFocken, TGrimwood, MEHemeon, IWSafina, BSheng, TSun, SWilson, MSZenova, AY Substituted triazolopyridines and methods of use thereof US Patent  US9550775 Publication Date 1/24/2017 
Target
Name:
Sodium channel protein type 9 subunit alpha
Synonyms:
NENA Peripheral sodium channel 1 SCN9A_HUMAN Voltage-gated sodium channel subunit Nav1.7 hNE-Na
Type:
Protein
Mol. Mass.:
226375.97
Organism:
Homo sapiens (Human)
Description:
Q15858
Residue:
1988
  
Inhibitor
Name:
BDBM268523
Synonyms:
N-(7-((3-chloro-5-methylphenoxy)methyl)-6-cyclopropyl-[1,2,4]triazolo[4,3-a]pyridin-3-yl)methanesulfonamide US9550775, 47
Type:
Small organic molecule
Emp. Form.:
C18H19ClN4O3S
Mol. Mass.:
406.886
SMILES:
Cc1cc(Cl)cc(OCc2cc3nnc(NS(C)(=O)=O)n3cc2C2CC2)c1
: