Target
Thymidylate synthase
Ligand
BDBM18770
Substrate
Meas. Tech.
Inhibition Assay
pH
7±0
Temperature
293.15±0 K
Ki
>2.45e+5±n/a nM
Citation
 Ferrari, SCosti, PMWade, RC Inhibitor specificity via protein dynamics: insights from the design of antibacterial agents targeted against thymidylate synthase. Chem Biol 10:1183-93 (2003)  
Target
Name:
Thymidylate synthase
Synonyms:
TS TYMS Thymidylate synthase (TS) | Thymidylate synthase/GAR transformylase/AICAR transformylase
Type:
Enzyme
Mol. Mass.:
35718.07
Organism:
Homo sapiens (Human)
Description:
Residue:
313
  
Inhibitor
Name:
BDBM18770
Synonyms:
1,8-naphthalein derivative, 18 Phenolnaphthalein derivative, 3
Type:
Small organic molecule
Emp. Form.:
C24H13ClF2O4
Mol. Mass.:
438.807
SMILES:
Oc1ccc(cc1F)C1(OC(=O)c2cccc3c(Cl)ccc1c23)c1ccc(O)c(F)c1
: