Target
G1/S-specific cyclin-E1
Ligand
BDBM59094
Substrate
Meas. Tech.
Kinase Inhibition Assay
IC50
1.1e+3±n/a nM
Citation
 McInnes, CWang, SAnderson, SO'Boyle, JJackson, WKontopidis, GMeades, CMezna, MThomas, MWood, GLane, DPFischer, PM Structural determinants of CDK4 inhibition and design of selective ATP competitive inhibitors. Chem Biol 11:525-34 (2004)  
Target
Name:
G1/S-specific cyclin-E1
Synonyms:
CCNE CCNE1_HUMAN
Type:
Enzyme Subunit
Mol. Mass.:
47073.17
Organism:
Homo sapiens (Human)
Description:
Residue:
410
  
Inhibitor
Name:
BDBM59094
Synonyms:
Aminopyrimidine, 6
Type:
Small organic molecule
Emp. Form.:
C19H22N6S
Mol. Mass.:
366.483
SMILES:
Cc1nc(C)c(s1)-c1ccnc(Nc2ccc(cc2)N2CCNCC2)n1
: