Target
Coagulation factor VIII
Ligand
BDBM59159
Substrate
Meas. Tech.
Inhibition Assay
pH
7.9±0
IC50
7.5e+3±n/a nM
Citation
 Spiegel, PCKaiser, SMSimon, JAStoddard, BL Disruption of protein-membrane binding and identification of small-molecule inhibitors of coagulation factor VIII. Chem Biol 11:1413-22 (2004)  
Target
Name:
Coagulation factor VIII
Synonyms:
AHF F8 FA8_HUMAN Factor VIII B chain Factor VIIIa heavy chain, 92 kDa isoform Procoagulant component
Type:
Protein
Mol. Mass.:
267036.98
Organism:
Homo sapiens (Human)
Description:
P00451
Residue:
2351
  
Inhibitor
Name:
BDBM59159
Synonyms:
6190013
Type:
Small organic molecule
Emp. Form.:
C15H7Cl2N3O5S
Mol. Mass.:
412.204
SMILES:
[#8-]-[#7+](=O)-c1cc(Cl)c(cc1Cl)-c1ccc(\[#6]=[#6]-2/[#6](=O)-[#7]-[#6](=S)-[#7]-[#6]-2=O)o1
: